BDBM190531 US9181184, 17::US9181184, 18
SMILES OC[C@@H]1[C@@H](O)[C@H](O)[C@@H](O)CN1CC1CCCO1
InChI Key InChIKey=UIMFXMIGFPYVEY-OXKBGPBOSA-N
Data  2 EC50
  Tab Delimited (TSV)   2D SDfile   Computed 3D by Vconf -m prep SDfile
Find this compound or compounds like it in BindingDB:
Activity Spreadsheet -- Enzyme Inhibition Constant Data from BindingDB
Found 2 hits for monomerid = 190531
TargetLysosomal alpha-glucosidase(Mus musculus (Mouse))
Amicus Therapeutics
US Patent
LigandPNGBDBM190531(US9181184, 17 | US9181184, 18)
Affinity DataEC50:  1.04E+5nMpH: 4.0Assay Description:Cells were washed two times with 200 μL dPBS followed by the addition of 70 μL of substrate (2.11 mM 3 mM 4-MU-α-D-glu) in citrate-pho...
In DepthDetails US Patent
TargetLysosomal alpha-glucosidase(Mus musculus (Mouse))
Amicus Therapeutics
US Patent
LigandPNGBDBM190531(US9181184, 17 | US9181184, 18)
Affinity DataEC50:  6.53E+5nMpH: 4.0Assay Description:Cells were washed two times with 200 μL dPBS followed by the addition of 70 μL of substrate (2.11 mM 3 mM 4-MU-α-D-glu) in citrate-pho...
In DepthDetails US Patent