BDBM190994 US10077266, Example 107::US9181249, 107::US9708313, 107
SMILES CC1Cc2nc(NCC(F)F)c(nc2CN1C(C)=O)N1CCC(CC1)Oc1ccc(F)cc1F
InChI Key InChIKey=BEIMMJQYRZFALE-UHFFFAOYSA-N
Data  3 IC50
  Tab Delimited (TSV)   2D SDfile   Computed 3D by Vconf -m prep SDfile
Find this compound or compounds like it in BindingDB:
Activity Spreadsheet -- Enzyme Inhibition Constant Data from BindingDB
Found 3 hits for monomerid = 190994
TargetG-protein coupled receptor 6(Homo sapiens (Human))
Takeda Pharmaceutical
US Patent
LigandPNGBDBM190994(US10077266, Example 107 | US9181249, 107 | US97083...)
Affinity DataIC50:  0.0249nMT: 2°C. Assay description: This cell based assay measures the ability of compounds to inhibit the constitutive cAMP activity of GPR6 receptor expressed in CHO-K1 cells. CHO cel...
In DepthDetails US Patent
TargetG-protein coupled receptor 6(Homo sapiens (Human))
Takeda Pharmaceutical
US Patent
LigandPNGBDBM190994(US10077266, Example 107 | US9181249, 107 | US97083...)
Affinity DataIC50:  2.49E+4nM. Assay description: Inhibition of cAMP Activity of GPR6 In Vitro AssayThis cell based assay measures the ability of compounds to inhibit the constitutive cAMP activity o...
In DepthDetails US Patent
TargetG-protein coupled receptor 6(Homo sapiens (Human))
Takeda Pharmaceutical
US Patent
LigandPNGBDBM190994(US10077266, Example 107 | US9181249, 107 | US97083...)
Affinity DataIC50:  2.49E+4nM. Assay description: This cell based assay measures the ability of compounds to inhibit the constitutive cAMP activity of GPR6 receptor expressed in CHO-K1 cells. CHO cel...
In DepthDetails US Patent