BDBM193758 US9670208, Example 379 4-(3-((1s,3s)-adamantan-1-ylmethyl)-[1,2,4]triazolo[4,3-a]pyridin-7-yl)-N-(1-methyl-1H-pyrazol-5-yl)pyrimidin-2-amine
SMILES Cn1nccc1Nc1nccc(n1)-c1ccn2c(CC34CC5CC(CC(C5)C3)C4)nnc2c1
InChI Key InChIKey=SXYCUOMFKPFOSV-UHFFFAOYSA-N
Data  1 IC50
  Tab Delimited (TSV)   2D SDfile   Computed 3D by Vconf -m prep SDfile
Find this compound or compounds like it in BindingDB:
Activity Spreadsheet -- Enzyme Inhibition Constant Data from BindingDB
Found 1 hit for monomerid = 193758
TargetMitogen-activated protein kinase 1 [8-360](Homo sapiens (Human))
Array Biopharma
US Patent
LigandPNGBDBM193758(US9670208, Example 379 4-(3-((1s,3s)-adamantan-1-y...)
Affinity DataIC50:  2.40nMpH: 7.3Assay Description:Compounds were tested in an enzymatic assay using human ERK-2 (Mitogen Activated Kinase 1), recombinantly expressed as an n-terminal 6-His fusion pro...
Ligand InfoPC cidPC sid
In DepthDetails US Patent