BDBM195445 US9670212, 60 3-amino-N-({8-methyl-2-[4-(1H-1,2,3-triazol-1-ylacetyl)-1,4-diazepan-1-yl]quinolin-3-yl}methyl)pyrazine-2-carboxamide
SMILES Cc1cccc2cc(CNC(=O)c3nccnc3N)c(nc12)N1CCCN(CC1)C(=O)Cn1ccnn1
InChI Key InChIKey=PWCIQOJXJWXKSF-UHFFFAOYSA-N
Data  1 IC50
  Tab Delimited (TSV)   2D SDfile   Computed 3D by Vconf -m prep SDfile
Find this compound or compounds like it in BindingDB:
Activity Spreadsheet -- Enzyme Inhibition Constant Data from BindingDB
Found 1 hit for monomerid = 195445
LigandPNGBDBM195445(US9670212, 60 3-amino-N-({8-methyl-2-[4-(1H-1,2,3-...)
Affinity DataIC50:  375nM. Assay description: Kinase activity is measured as the percent of ATP consumed following the kinase reaction using luciferase-luciferin-coupled chemiluminescence. Reacti...
Ligand InfoPC cidPC sid
In DepthDetails US Patent