BDBM19662 (2R)-N-[(2S)-3-methyl-1-{[4-(trifluoromethoxy)phenyl]amino}butan-2-yl]-2-[2-(morpholin-4-yl)-2-oxoethyl]-5-phenylpentanamide::succinamide peptidomimetic, 28
SMILES CC(C)[C@@H](CNc1ccc(OC(F)(F)F)cc1)NC(=O)[C@H](CCCc1ccccc1)CC(=O)N1CCOCC1
InChI Key InChIKey=ICMOGVUCPZRKGU-ZEQKJWHPSA-N
Data  3 KI
  Tab Delimited (TSV)   2D SDfile   Computed 3D by Vconf -m prep SDfile
Find this compound or compounds like it in BindingDB:
Activity Spreadsheet -- Enzyme Inhibition Constant Data from BindingDB
Found 3 hits for monomerid = 19662
TargetCathepsin S(Homo sapiens (Human))
Gnf
LigandPNGBDBM19662((2R)-N-[(2S)-3-methyl-1-{[4-(trifluoromethoxy)phen...)
Affinity DataKi:  14nM ΔG°:  -11.1kcal/molepH: 5.5 T: 2°C. Assay description: The recombinant human cathepsin enzyme was preincubated with inhibitor for 20 minutes prior to addition of substrate. The substrate hydrolysis was mo...
In DepthDetails ArticlePubMed
TargetProcathepsin L(Homo sapiens (Human))
Gnf
LigandPNGBDBM19662((2R)-N-[(2S)-3-methyl-1-{[4-(trifluoromethoxy)phen...)
Affinity DataKi:  197nM. Assay description: The recombinant human cathepsin enzyme was preincubated with inhibitor for 20 minutes prior to addition of substrate. The substrate hydrolysis was mo...
In DepthDetails ArticlePubMed
TargetCathepsin K(Homo sapiens (Human))
Gnf
LigandPNGBDBM19662((2R)-N-[(2S)-3-methyl-1-{[4-(trifluoromethoxy)phen...)
Affinity DataKi:  2.12E+3nM. Assay description: The recombinant human cathepsin enzyme was preincubated with inhibitor for 20 minutes prior to addition of substrate. The substrate hydrolysis was mo...
In DepthDetails ArticlePubMed