BDBM197350 US9216962, CFH395-C
SMILES ONC(=O)CCCCCCNC(=O)c1nc(sc1C1CC1)-c1nccs1
InChI Key InChIKey=GDOXAXRWFWEZBO-UHFFFAOYSA-N
Data  3 IC50
  Tab Delimited (TSV)   2D SDfile   Computed 3D by Vconf -m prep SDfile
Find this compound or compounds like it in BindingDB:
Activity Spreadsheet -- Enzyme Inhibition Constant Data from BindingDB
Found 3 hits for monomerid = 197350
TargetHistone deacetylase 1(Homo sapiens (Human))
Shanghai Puyi Chemical
US Patent
LigandPNGBDBM197350(US9216962, CFH395-C)
Affinity DataIC50:  20nM. Assay description: Enzyme activity of HDAC1,3 is determined using the substrate Ac-Lys-Tyr-Lys(Ac)-AMC while the enzyme activity of HDAC6 is assayed using the substrate...
Ligand InfoPC cidPC sid
In DepthDetails US Patent
TargetHistone deacetylase 6(Homo sapiens (Human))
Shanghai Puyi Chemical
US Patent
LigandPNGBDBM197350(US9216962, CFH395-C)
Affinity DataIC50:  10nM. Assay description: Enzyme activity of HDAC1,3 is determined using the substrate Ac-Lys-Tyr-Lys(Ac)-AMC while the enzyme activity of HDAC6 is assayed using the substrate...
Ligand InfoPC cidPC sid
In DepthDetails US Patent
TargetHistone deacetylase 3(Homo sapiens (Human))
Shanghai Puyi Chemical
US Patent
LigandPNGBDBM197350(US9216962, CFH395-C)
Affinity DataIC50:  10nM. Assay description: Enzyme activity of HDAC1,3 is determined using the substrate Ac-Lys-Tyr-Lys(Ac)-AMC while the enzyme activity of HDAC6 is assayed using the substrate...
Ligand InfoPC cidPC sid
In DepthDetails US Patent