BDBM199666 US9226922, 302
SMILES COC(C)(C)COc1n[nH]c2cc(NC(=O)N[C@H](C)c3ccccc3)ncc12
InChI Key
Data  1 IC50
  Tab Delimited (TSV)   2D SDfile   Computed 3D by Vconf -m prep SDfile
Find this compound or compounds like it in BindingDB:
Activity Spreadsheet -- Enzyme Inhibition Constant Data from BindingDB
Found 1 hit for monomerid = 199666
TargetMitogen-activated protein kinase 1(Homo sapiens (Human))
Merck Sharp & Dohme
US Patent
LigandPNGBDBM199666(US9226922, 302)
Affinity DataIC50:  27.8nM. Assay description: Activated ERK2 activity was determined in an IMAP-FP assay (Molecular Devices). Using this assay format, the potency (IC50) of each compound was dete...
Ligand InfoPC cidPC sid
In DepthDetails US Patent