BDBM2006 10-ethyl-14-methyl-12-nitro-2-oxa-4,10-diazatricyclo[9.4.0.0^{3,8}]pentadeca-1(15),3,5,7,11,13-hexaen-9-one::Pyridobenzoxazepinone 74
SMILES CCN1c2c(Oc3ncccc3C1=O)cc(C)cc2[N+]([O-])=O
InChI Key InChIKey=JMMPZYQZVRRZDH-UHFFFAOYSA-N
Data  1 IC50
  Tab Delimited (TSV)   2D SDfile   Computed 3D by Vconf -m prep SDfile
Find this compound or compounds like it in BindingDB:
Activity Spreadsheet -- Enzyme Inhibition Constant Data from BindingDB
Found 1 hit for monomerid = 2006
TargetGag-Pol polyprotein [600-1027,R876K]/[600-1155](Human immunodeficiency virus type 1)
Boehringer Ingelheim Pharmaceuticals
LigandPNGBDBM2006(10-ethyl-14-methyl-12-nitro-2-oxa-4,10-diazatricyc...)
Affinity DataIC50:  31nM. Assay description: The IC50 of reverse transcriptase is the concentration that inhibits 50% of recombinant HIV-1 RT RNA-directed DNA polymerase activity in vitro.
In DepthDetails ArticlePubMed