BDBM200912 US9233946, 11
SMILES CC(C)c1ccc2sc(c(C)c2c1)S(=O)(=O)Nc1cc(cc(c1)[N+]([O-])=O)C(O)=O
InChI Key InChIKey=PJNYMXUZRPHRKR-UHFFFAOYSA-N
Data  1 IC50
  Tab Delimited (TSV)   2D SDfile   Computed 3D by Vconf -m prep SDfile
Find this compound or compounds like it in BindingDB:
Activity Spreadsheet -- Enzyme Inhibition Constant Data from BindingDB
Found 1 hit for monomerid = 200912
Target6-phosphofructo-2-kinase/fructose-2,6-bisphosphatase 3(Homo sapiens (Human))
Kancera
US Patent
LigandPNGBDBM200912(US9233946, 11)
Affinity DataIC50:  850nM. Assay description: Method A: The kinase activity of the bi-functional enzyme is readily quantified based on the production of F-2,6-P2 as described by Van Schaftingen e...
Ligand InfoPC cidPC sid
In DepthDetails US Patent