BDBM201011 US9540364, example 21
SMILES OC[C@H]1OC[C@@H](Oc2nc3c(F)c(c(F)cc3[nH]2)-c2ccc(cc2)-c2ccc(cc2F)C#N)[C@@H]1O
InChI Key
Data  1 EC50
  Tab Delimited (TSV)   2D SDfile   Computed 3D by Vconf -m prep SDfile
Find this compound or compounds like it in BindingDB:
Activity Spreadsheet -- Enzyme Inhibition Constant Data from BindingDB
Found 1 hit for monomerid = 201011
Target5'-AMP-activated protein kinase catalytic subunit alpha-1(Homo sapiens (Human))
Merck Sharp & Dohme
US Patent
LigandPNGBDBM201011(US9540364, example 21)
Affinity DataEC50:  38nMpH: 7.3Assay Description:The in vitro AMPK activation assay is performed in a volume of 30 μl in a 384-well plate. Enzyme reactions were assembled in the microtiter plat...
Ligand InfoPC cidPC sid
In DepthDetails US Patent