BDBM201318 US9187424, 82
SMILES Cc1ccc(NC(=O)C2=C(CC(NC2=O)(c2ccc(OCCCC(F)(F)F)cc2)C(F)(F)F)c2ccc(C)cc2)cc1
InChI Key InChIKey=HBWGSZZXRWSMSM-UHFFFAOYSA-N
Data  2 IC50
  Tab Delimited (TSV)   2D SDfile   Computed 3D by Vconf -m prep SDfile
Find this compound or compounds like it in BindingDB:
Activity Spreadsheet -- Enzyme Inhibition Constant Data from BindingDB
Found 2 hits for monomerid = 201318
TargetAlpha-1,6-mannosyl-glycoprotein 2-beta-N-acetylglucosaminyltransferase(Homo sapiens (Human))
Bristol-Myers Squibb
US Patent
LigandPNGBDBM201318(US9187424, 82)
Affinity DataIC50:  133nMpH: 7.4 T: 2°C. Assay description: MGAT2 enzyme was assayed using membranes isolated from Sf9 cells expressing the recombinant human MGAT2 cDNA with 2-monooleoylglycerol and [3H]-oleoy...
Ligand InfoPC cidPC sid
In DepthDetails US Patent
TargetAlpha-1,6-mannosyl-glycoprotein 2-beta-N-acetylglucosaminyltransferase(Homo sapiens (Human))
Bristol-Myers Squibb
US Patent
LigandPNGBDBM201318(US9187424, 82)
Affinity DataIC50:  2nMpH: 7.4Assay Description:The MGAT enzyme reactions were performed in CORNING Falcon 96-well Polypropylene plates, in a total volume of 60 uL of 50 mM Potassium Phosphate buff...
Ligand InfoPC cidPC sid
In DepthDetails US Patent