BDBM201537 US9187424, 304::US9187424, 309
SMILES Fc1cc(ccc1OCCCCCC(F)(F)F)C1(CC(=C(c2nn[nH]n2)C(=O)N1)c1ccc2ccccc2c1)C(F)(F)F
InChI Key
Data  2 IC50
  Tab Delimited (TSV)   2D SDfile   Computed 3D by Vconf -m prep SDfile
Find this compound or compounds like it in BindingDB:
Activity Spreadsheet -- Enzyme Inhibition Constant Data from BindingDB
Found 2 hits for monomerid = 201537
TargetAlpha-1,6-mannosyl-glycoprotein 2-beta-N-acetylglucosaminyltransferase(Homo sapiens (Human))
Bristol-Myers Squibb
US Patent
LigandPNGBDBM201537(US9187424, 304 | US9187424, 309)
Affinity DataIC50:  1nMpH: 7.4Assay Description:The MGAT enzyme reactions were performed in CORNING Falcon 96-well Polypropylene plates, in a total volume of 60 uL of 50 mM Potassium Phosphate buff...
Ligand InfoPC cidPC sid
In DepthDetails US Patent
TargetAlpha-1,6-mannosyl-glycoprotein 2-beta-N-acetylglucosaminyltransferase(Homo sapiens (Human))
Bristol-Myers Squibb
US Patent
LigandPNGBDBM201537(US9187424, 304 | US9187424, 309)
Affinity DataIC50:  6nMpH: 7.4Assay Description:The MGAT enzyme reactions were performed in CORNING Falcon 96-well Polypropylene plates, in a total volume of 60 uL of 50 mM Potassium Phosphate buff...
Ligand InfoPC cidPC sid
In DepthDetails US Patent