BDBM202005 US9233979, 437
SMILES OC[C@@H](NC(=O)Nc1cc2[nH]nc(N3CCOCC3)c2cn1)c1ccccc1
InChI Key
Data  1 IC50
  Tab Delimited (TSV)   2D SDfile   Computed 3D by Vconf -m prep SDfile
Find this compound or compounds like it in BindingDB:
Activity Spreadsheet -- Enzyme Inhibition Constant Data from BindingDB
Found 1 hit for monomerid = 202005
TargetMitogen-activated protein kinase 1(Homo sapiens (Human))
Merck Sharp & Dohme
US Patent
LigandPNGBDBM202005(US9233979, 437)
Affinity DataIC50:  0.400nM. Assay description: Activated ERK2 activity was determined in an IMAP-FP assay (Molecular Devices). Using this assay format, the potency (IC50) of each compound was de...
Ligand InfoPC cidPC sid
In DepthDetails US Patent