BDBM202832 US10245267, Example 179::US10709712, Example 179::US9242969, 179::US9694016, 179
SMILES Cc1ccc(NC(=O)c2ccnc(c2)C(F)(F)F)cc1-c1cc(N2CCOCC2)c(=O)n(C)c1
InChI Key InChIKey=CYQSREZKCOHNRE-UHFFFAOYSA-N
Data  14 IC50
  Tab Delimited (TSV)   2D SDfile   Computed 3D by Vconf -m prep SDfile
Find this compound or compounds like it in BindingDB:
Activity Spreadsheet -- Enzyme Inhibition Constant Data from BindingDB
Found 14 hits for monomerid = 202832
TargetSerine/threonine-protein kinase B-raf(Homo sapiens (Human))
Novartis
US Patent
LigandPNGBDBM202832(US10245267, Example 179 | US10709712, Example 179 ...)
Affinity DataIC50:  0.905nMpH: 7.5 T: 2°C. Assay description: Final assay conditions were 4 pM cRaf, 3 uM ATP, 10 nM biotin tagged MEK1 kinase dead protein substrate. Reactions were performed in Greiner384 well ...
In DepthDetails US Patent
TargetRAF proto-oncogene serine/threonine-protein kinase [Y340E,Y341E](Homo sapiens (Human))
Novartis
US Patent
LigandPNGBDBM202832(US10245267, Example 179 | US10709712, Example 179 ...)
Affinity DataIC50:  0.160nMpH: 7.5 T: 2°C. Assay description: Final assay conditions were 4 pM cRaf, 3 uM ATP, 10 nM biotin tagged MEK1 kinase dead protein substrate. Reactions were performed in Greiner384 well ...
In DepthDetails US Patent
TargetSerine/threonine-protein kinase B-raf [V600E](Homo sapiens (Human))
Novartis
US Patent
LigandPNGBDBM202832(US10245267, Example 179 | US10709712, Example 179 ...)
Affinity DataIC50:  0.900nMpH: 7.5 T: 2°C. Assay description: Raf and biotinylated Mek, kinase dead, were combined at 2x final concentrations in assay buffer (50 mM Tris, pH 7.5, 15 mM MgCl2, 0.01% BSA and 1 mM ...
In DepthDetails US Patent
TargetRAF proto-oncogene serine/threonine-protein kinase [Y340E,Y341E](Homo sapiens (Human))
Novartis
US Patent
LigandPNGBDBM202832(US10245267, Example 179 | US10709712, Example 179 ...)
Affinity DataIC50:  0.200nMpH: 7.5 T: 2°C. Assay description: Raf and biotinylated Mek, kinase dead, were combined at 2x final concentrations in assay buffer (50 mM Tris, pH 7.5, 15 mM MgCl2, 0.01% BSA and 1 mM ...
In DepthDetails US Patent
TargetSerine/threonine-protein kinase B-raf [V600E](Homo sapiens (Human))
Novartis
US Patent
LigandPNGBDBM202832(US10245267, Example 179 | US10709712, Example 179 ...)
Affinity DataIC50:  0.910nMpH: 7.5 T: 2°C. Assay description: Raf and biotinylated Mek, kinase dead, were combined at 2x final concentrations in assay buffer (50 mM Tris, pH 7.5, 15 mM MgCl2, 0.01% BSA and 1 mM ...
In DepthDetails US Patent
TargetRAF proto-oncogene serine/threonine-protein kinase [Y340E,Y341E](Homo sapiens (Human))
Novartis
US Patent
LigandPNGBDBM202832(US10245267, Example 179 | US10709712, Example 179 ...)
Affinity DataIC50:  0.160nMpH: 7.5 T: 2°C. Assay description: Raf and biotinylated Mek, kinase dead, were combined at 2x final concentrations in assay buffer (50 mM Tris, pH 7.5, 15 mM MgCl2, 0.01% BSA and 1 mM ...
In DepthDetails US Patent
TargetRAF proto-oncogene serine/threonine-protein kinase(Homo sapiens (Human))
Novartis
US Patent
LigandPNGBDBM202832(US10245267, Example 179 | US10709712, Example 179 ...)
Affinity DataIC50:  0.200nM. Assay description: C-Raf TR refers to a truncated C-Raf protein, a Δ1-324 deletion mutant.C-Raf FL refers to the full-length C-Raf protein.Full length MEK1 with an...
In DepthDetails US Patent
TargetRAF proto-oncogene serine/threonine-protein kinase(Homo sapiens (Human))
Novartis
US Patent
LigandPNGBDBM202832(US10245267, Example 179 | US10709712, Example 179 ...)
Affinity DataIC50:  0.200nM. Assay description: Raf and biotinylated Mek, kinase dead, were combined at 2× final concentrations in assay buffer (50 mM Tris, pH 7.5, 15 mM MgCl2, 0.01% BSA and 1 mM ...
In DepthDetails US Patent
TargetSerine/threonine-protein kinase B-raf [V600E](Homo sapiens (Human))
Novartis
US Patent
LigandPNGBDBM202832(US10245267, Example 179 | US10709712, Example 179 ...)
Affinity DataIC50:  0.905nM. Assay description: Raf and biotinylated Mek, kinase dead, were combined at 2× final concentrations in assay buffer (50 mM Tris, pH 7.5, 15 mM MgCl2, 0.01% BSA and 1 mM ...
In DepthDetails US Patent
TargetRAF proto-oncogene serine/threonine-protein kinase(Homo sapiens (Human))
Novartis
US Patent
LigandPNGBDBM202832(US10245267, Example 179 | US10709712, Example 179 ...)
Affinity DataIC50:  0.160nM. Assay description: Raf and biotinylated Mek, kinase dead, were combined at 2× final concentrations in assay buffer (50 mM Tris, pH 7.5, 15 mM MgCl2, 0.01% BSA and 1 mM ...
In DepthDetails US Patent
TargetSerine/threonine-protein kinase B-raf [V600E](Homo sapiens (Human))
Novartis
US Patent
LigandPNGBDBM202832(US10245267, Example 179 | US10709712, Example 179 ...)
Affinity DataIC50:  0.905nM. Assay description: C-Raf TR refers to a truncated C-Raf protein, a Δ1-324 deletion mutant.C-Raf FL refers to the full-length C-Raf protein.Full length MEK1 with an...
In DepthDetails US Patent
TargetRAF proto-oncogene serine/threonine-protein kinase(Homo sapiens (Human))
Novartis
US Patent
LigandPNGBDBM202832(US10245267, Example 179 | US10709712, Example 179 ...)
Affinity DataIC50:  0.160nM. Assay description: C-Raf TR refers to a truncated C-Raf protein, a Δ1-324 deletion mutant.C-Raf FL refers to the full-length C-Raf protein.Full length MEK1 with an...
In DepthDetails US Patent
TargetSerine/threonine-protein kinase B-raf [V600E](Homo sapiens (Human))
Novartis
US Patent
LigandPNGBDBM202832(US10245267, Example 179 | US10709712, Example 179 ...)
Affinity DataIC50:  0.900nM. Assay description: C-Raf TR refers to a truncated C-Raf protein, a Δ1-324 deletion mutant.C-Raf FL refers to the full-length C-Raf protein.Full length MEK1 with an...
In DepthDetails US Patent
TargetSerine/threonine-protein kinase B-raf [V600E](Homo sapiens (Human))
Novartis
US Patent
LigandPNGBDBM202832(US10245267, Example 179 | US10709712, Example 179 ...)
Affinity DataIC50:  0.900nM. Assay description: Raf and biotinylated Mek, kinase dead, were combined at 2× final concentrations in assay buffer (50 mM Tris, pH 7.5, 15 mM MgCl2, 0.01% BSA and 1 mM ...
In DepthDetails US Patent