BDBM203350 US9539260, B14::US9763952, Example B14
SMILES COc1ncc(cc1C(F)(F)F)N1CCOc2ccc(O[C@H]3CCN(C3)C(=O)C3CCS(=O)(=O)CC3)cc12
InChI Key InChIKey=FIKICNBUTIASAB-IBGZPJMESA-N
Data  4 IC50
  Tab Delimited (TSV)   2D SDfile   Computed 3D by Vconf -m prep SDfile
Find this compound or compounds like it in BindingDB:
Activity Spreadsheet -- Enzyme Inhibition Constant Data from BindingDB
Found 4 hits for monomerid = 203350
LigandPNGBDBM203350(US9539260, B14 | US9763952, Example B14)
Affinity DataIC50:  244nMT: 2°C. Assay description: Determination of Enzymatic PI3K Alpha and PI3K Delta Isoform Inhibition1.1 Test of Lipid Kinase ActivityThe efficacy of the compounds of examples 1-1...
Ligand InfoPC cidPC sid
In DepthDetails US Patent
LigandPNGBDBM203350(US9539260, B14 | US9763952, Example B14)
Affinity DataIC50:  6nM
Ligand InfoPC cidPC sid
In DepthDetails US Patent
LigandPNGBDBM203350(US9539260, B14 | US9763952, Example B14)
Affinity DataIC50:  244nM. Assay description: The kinase reaction is performed in a final volume of 50 μl per well of a half area COSTAR, 96 well plate. The final concentrations of ATP and p...
Ligand InfoPC cidPC sid
In DepthDetails US Patent
LigandPNGBDBM203350(US9539260, B14 | US9763952, Example B14)
Affinity DataIC50:  6nMT: 2°C. Assay description: Determination of Enzymatic PI3K Alpha and PI3K Delta Isoform Inhibition1.1 Test of Lipid Kinase ActivityThe efficacy of the compounds of examples 1-1...
Ligand InfoPC cidPC sid
In DepthDetails US Patent