BDBM203466 US9221809, 3
SMILES OC[C@H]1C[C@@H](Nc2nc(NC3CC3)[nH]c(=O)c2-c2nc3ccccc3s2)[C@H](O)[C@@H]1O
InChI Key
Data  2 IC50
PDB links: 1 PDB ID matches this monomer.
  Tab Delimited (TSV)   2D SDfile   Computed 3D by Vconf -m prep SDfile
Find this compound or compounds like it in BindingDB:
Activity Spreadsheet -- Enzyme Inhibition Constant Data from BindingDB
Found 2 hits for monomerid = 203466
TargetInterleukin-1 receptor-associated kinase 4(Homo sapiens (Human))
Merck Research Laboratories
Curated by ChEMBL
LigandPNGBDBM203466(US9221809, 3)
Affinity DataIC50:  25nM. Assay description: Inhibition of IRAK4 (unknown origin) using 5FAM-RKRQGSVRRRVHCCOOH as substrate after 30 mins by IMAP assay
Ligand InfoPC cidPC sidPDB
TargetInterleukin-1 receptor-associated kinase 4(Homo sapiens (Human))
Merck Research Laboratories
Curated by ChEMBL
LigandPNGBDBM203466(US9221809, 3)
Affinity DataIC50:  25nMpH: 7.2 T: 2°C. Assay description: A 20 ul reaction mixture contains 10 mM TriHCl, pH 7.2, 0.5 nM GST tagged IRAK4 (SignalChem), 100 nM fluorescent peptide substrate (RP7030, Molecul...
Ligand InfoPC cidPC sidPDB