BDBM204112 US9539260, H13::US9539260, H14::US9763952, Example H14
SMILES COc1ncc(cc1Cl)N1CCOc2ccc(O[C@H]3CCN(C3)C(=O)C3CCS(=O)(=O)C3)cc12
InChI Key InChIKey=YRIAMBGVNZJXLP-PKHIMPSTSA-N
Data  10 IC50
  Tab Delimited (TSV)   2D SDfile   Computed 3D by Vconf -m prep SDfile
Find this compound or compounds like it in BindingDB:
Activity Spreadsheet -- Enzyme Inhibition Constant Data from BindingDB
Found 10 hits for monomerid = 204112
LigandPNGBDBM204112(US9539260, H13 | US9539260, H14 | US9763952, Examp...)
Affinity DataIC50:  387nMT: 2°C. Assay description: Determination of Enzymatic PI3K Alpha and PI3K Delta Isoform Inhibition1.1 Test of Lipid Kinase ActivityThe efficacy of the compounds of examples 1-1...
Ligand InfoPC cidPC sid
In DepthDetails US Patent
LigandPNGBDBM204112(US9539260, H13 | US9539260, H14 | US9763952, Examp...)
Affinity DataIC50:  9nMT: 2°C. Assay description: Determination of Enzymatic PI3K Alpha and PI3K Delta Isoform Inhibition1.1 Test of Lipid Kinase ActivityThe efficacy of the compounds of examples 1-1...
Ligand InfoPC cidPC sid
In DepthDetails US Patent
LigandPNGBDBM204112(US9539260, H13 | US9539260, H14 | US9763952, Examp...)
Affinity DataIC50:  103nMT: 2°C. Assay description: Determination of Enzymatic PI3K Alpha and PI3K Delta Isoform Inhibition1.1 Test of Lipid Kinase ActivityThe efficacy of the compounds of examples 1-1...
Ligand InfoPC cidPC sid
In DepthDetails US Patent
LigandPNGBDBM204112(US9539260, H13 | US9539260, H14 | US9763952, Examp...)
Affinity DataIC50:  5nMT: 2°C. Assay description: Determination of Enzymatic PI3K Alpha and PI3K Delta Isoform Inhibition1.1 Test of Lipid Kinase ActivityThe efficacy of the compounds of examples 1-1...
Ligand InfoPC cidPC sid
In DepthDetails US Patent
LigandPNGBDBM204112(US9539260, H13 | US9539260, H14 | US9763952, Examp...)
Affinity DataIC50:  5nM
Ligand InfoPC cidPC sid
In DepthDetails US Patent
LigandPNGBDBM204112(US9539260, H13 | US9539260, H14 | US9763952, Examp...)
Affinity DataIC50:  20nM
Ligand InfoPC cidPC sid
In DepthDetails US Patent
LigandPNGBDBM204112(US9539260, H13 | US9539260, H14 | US9763952, Examp...)
Affinity DataIC50:  387nM. Assay description: The kinase reaction is performed in a final volume of 50 μl per well of a half area COSTAR, 96 well plate. The final concentrations of ATP and p...
Ligand InfoPC cidPC sid
In DepthDetails US Patent
LigandPNGBDBM204112(US9539260, H13 | US9539260, H14 | US9763952, Examp...)
Affinity DataIC50:  9nM
Ligand InfoPC cidPC sid
In DepthDetails US Patent
LigandPNGBDBM204112(US9539260, H13 | US9539260, H14 | US9763952, Examp...)
Affinity DataIC50:  103nM. Assay description: The kinase reaction is performed in a final volume of 50 μl per well of a half area COSTAR, 96 well plate. The final concentrations of ATP and p...
Ligand InfoPC cidPC sid
In DepthDetails US Patent
LigandPNGBDBM204112(US9539260, H13 | US9539260, H14 | US9763952, Examp...)
Affinity DataIC50:  762nM. Assay description: The kinase reaction is performed in a final volume of 50 μl per well of a half area COSTAR, 96 well plate. The final concentrations of ATP and p...
Ligand InfoPC cidPC sid
In DepthDetails US Patent