BDBM206099 US9255110, 12
SMILES O[C@H]1CC[C@@H](CC1)Oc1cc2ncccc2cc1NC(=O)c1csc2cncnc12
InChI Key InChIKey=MURKOANUFGPGGP-SHTZXODSSA-N
Data  2 IC50
  Tab Delimited (TSV)   2D SDfile   Computed 3D by Vconf -m prep SDfile
Find this compound or compounds like it in BindingDB:
Activity Spreadsheet -- Enzyme Inhibition Constant Data from BindingDB
Found 2 hits for monomerid = 206099
TargetInterleukin-1 receptor-associated kinase 1(Homo sapiens (Human))
Roche Palo Alto
US Patent
LigandPNGBDBM206099(US9255110, 12)
Affinity DataIC50:  168nM. Assay description: Purified recombinant IRAK-4 protein was incubated with 250 uM synthetic peptide(KKARFSRFAGSSPSQSSMVAR) in 30 ul of kinase buffer including (20 mM MOP...
Ligand InfoPC cidPC sid
In DepthDetails US Patent
TargetInterleukin-1 receptor-associated kinase 4(Homo sapiens (Human))
Roche Palo Alto
US Patent
LigandPNGBDBM206099(US9255110, 12)
Affinity DataIC50:  11nM. Assay description: Purified recombinant IRAK-4 protein was incubated with 250 uM synthetic peptide(KKARFSRFAGSSPSQSSMVAR) in 30 ul of kinase buffer including (20 mM MOP...
Ligand InfoPC cidPC sid
In DepthDetails US Patent