BDBM20667 methyl N-(4-methyl-3-{[5-methyl-6-(propylcarbamoyl)pyrrolo[1,2-a][1,2,4]triazin-4-yl]amino}phenyl)carbamate::pyrrolo[2,1-f][1,2,4]triazine analogue, 21a
SMILES CCCNC(=O)c1cn2ncnc(Nc3cc(NC(=O)OC)ccc3C)c2c1C
InChI Key InChIKey=KCFHGYIYPXLYLA-UHFFFAOYSA-N
Data  1 IC50  1 EC50
  Tab Delimited (TSV)   2D SDfile   Computed 3D by Vconf -m prep SDfile
Find this compound or compounds like it in BindingDB:
Activity Spreadsheet -- Enzyme Inhibition Constant Data from BindingDB
Found 1 hit for monomerid = 20667
TargetMitogen-activated protein kinase 14(Homo sapiens (Human))
Novartis Pharmaceuticals
LigandPNGBDBM20667(methyl N-(4-methyl-3-{[5-methyl-6-(propylcarbamoyl...)
Affinity DataIC50:  15nM EC50:  150nMpH: 7.5 T: 2°C. Assay description: The kinase activity was determined by quantitation of the amount of radioactive phosphate transferred to myelin basic protein (MBP) with or without i...
In DepthDetails ArticlePubMed