BDBM207159 US9260439, 136
SMILES C[C@H]1COCCN1c1nc2N(CCc2c(n1)-c1cnc(N)nc1)[C@@H]1CCN(C1)C(=O)OC1CN(C1)C(C)=O
InChI Key InChIKey=JXRHBBVTWLZLBA-MAUKXSAKSA-N
Data  2 KI
  Tab Delimited (TSV)   2D SDfile   Computed 3D by Vconf -m prep SDfile
Find this compound or compounds like it in BindingDB:
Activity Spreadsheet -- Enzyme Inhibition Constant Data from BindingDB
Found 2 hits for monomerid = 207159
LigandPNGBDBM207159(US9260439, 136)
Affinity DataKi:  0.0990nM. Assay description: PI3KA_Act: Genes encoding for full length p110alpha and p85alpha nSH-iSH2=niSH2 (p85a aminoacids 322-600) subunits of PI3Kalpha complex were subclone...
Ligand InfoPC cidPC sid
In DepthDetails US Patent
LigandPNGBDBM207159(US9260439, 136)
Affinity DataKi: <0.229nM. Assay description: PI3KA_FL: Genes encoding for full length p110alpha and p85alpha subunits of PI3Kalpha complex were subcloned from existing constructs into pFASTBAC D...
Ligand InfoPC cidPC sid
In DepthDetails US Patent