BDBM208955 US9266881, 2-4
SMILES Brc1cccc2nn(CCc3ccc4ccccc4n3)c(=O)n12
InChI Key InChIKey=OIDRICYLZQIREO-UHFFFAOYSA-N
Data  1 KI
  Tab Delimited (TSV)   2D SDfile   Computed 3D by Vconf -m prep SDfile
Find this compound or compounds like it in BindingDB:
Activity Spreadsheet -- Enzyme Inhibition Constant Data from BindingDB
Found 1 hit for monomerid = 208955
TargetcAMP and cAMP-inhibited cGMP 3',5'-cyclic phosphodiesterase 10A(Homo sapiens (Human))
Merck Sharp & Dohme
US Patent
LigandPNGBDBM208955(US9266881, 2-4)
Affinity DataKi:  59nM ΔG°:  -9.86kcal/molepH: 7.2 T: 2°C. Assay description: The fluorescence polarization assay for cyclic nucleotide phosphodiesterases was performed using an IMAPĀ® FP kit supplied by Molecular Devices, Sunn...
Ligand InfoPC cidPC sid
In DepthDetails US Patent