BDBM208964 US9266881, A-1
SMILES O=c1n(CCc2ccc3ccccc3n2)nc2cccc(-c3cccnc3)n12
InChI Key InChIKey=RNLURMNZEAZXJG-UHFFFAOYSA-N
Data  1 KI
  Tab Delimited (TSV)   2D SDfile   Computed 3D by Vconf -m prep SDfile
Find this compound or compounds like it in BindingDB:
Activity Spreadsheet -- Enzyme Inhibition Constant Data from BindingDB
Found 1 hit for monomerid = 208964
TargetcAMP and cAMP-inhibited cGMP 3',5'-cyclic phosphodiesterase 10A(Homo sapiens (Human))
Merck Sharp & Dohme
US Patent
LigandPNGBDBM208964(US9266881, A-1)
Affinity DataKi:  9nM ΔG°:  -11.0kcal/molepH: 7.2 T: 2°C. Assay description: The fluorescence polarization assay for cyclic nucleotide phosphodiesterases was performed using an IMAPĀ® FP kit supplied by Molecular Devices, Sunn...
Ligand InfoPC cidPC sid
In DepthDetails US Patent