BDBM209350 US9266883, 149
SMILES COCCNc1cc(NC(=O)N2CCCc3cc(CN4CCSCC4=O)c(C=O)nc23)ncc1C#N
InChI Key InChIKey=RHBPKCPULCGKFB-UHFFFAOYSA-N
Data  1 IC50
  Tab Delimited (TSV)   2D SDfile   Computed 3D by Vconf -m prep SDfile
Find this compound or compounds like it in BindingDB:
Activity Spreadsheet -- Enzyme Inhibition Constant Data from BindingDB
Found 1 hit for monomerid = 209350
TargetFibroblast growth factor receptor 4 [388-802](Homo sapiens (Human))
Novartis
US Patent
LigandPNGBDBM209350(US9266883, 149)
Affinity DataIC50:  0.100nMpH: 7.5 T: 2°C. Assay description: Liquid handling and incubation steps were done on an Innovadyne Nanodrop Express equipped with a robotic arm (Thermo CatX, Caliper Twister II) and an...
Ligand InfoPC cidPC sid
In DepthDetails US Patent