BDBM209465 US10328074, Example III-6::US11077107, Example III-6::US9266891, III-6
SMILES COCCN1CCC(CC1)Nc1nc(cn2c(C)nnc12)-c1nc2ccccc2n1Cc1ccc(F)c(F)c1
InChI Key InChIKey=YMNBDQGRLMZZPM-UHFFFAOYSA-N
Data  3 IC50
  Tab Delimited (TSV)   2D SDfile   Computed 3D by Vconf -m prep SDfile
Find this compound or compounds like it in BindingDB:
Activity Spreadsheet -- Enzyme Inhibition Constant Data from BindingDB
Found 3 hits for monomerid = 209465
TargetBromodomain-containing protein 4 [44-168]/Histone H4(Homo sapiens (Human))
Boehringer Ingelheim International
US Patent
LigandPNGBDBM209465(US10328074, Example III-6 | US11077107, Example II...)
Affinity DataIC50:  9nM. Assay description: Compounds are diluted in serial dilution 1:5 in assay buffer from 10 mM stock in DMSO (100 uM start concentration) in white OptiPlate-384 (PerkinElme...
Ligand InfoPC cidPC sid
In DepthDetails US Patent
TargetBromodomain-containing protein 4 [44-168](Homo sapiens (Human))
TBA
US Patent
LigandPNGBDBM209465(US10328074, Example III-6 | US11077107, Example II...)
Affinity DataIC50:  9nM. Assay description: Compounds are diluted in serial dilution 1:5 in assay buffer from 10 mM stock in DMSO (100 μM start concentration) in white OptiPlate-384 (Perki...
Ligand InfoPC cidPC sid
In DepthDetails US Patent
TargetBromodomain-containing protein 4 [42-168](Homo sapiens (Human))
Boehringer Ingelheim International
US Patent
LigandPNGBDBM209465(US10328074, Example III-6 | US11077107, Example II...)
Affinity DataIC50:  9nM. Assay description: This assay is used to determine whether the compounds inhibit the interaction between the first (BRD4-BD1) or the second (BRD4-BD2) bromodomain of BR...
Ligand InfoPC cidPC sid
In DepthDetails US Patent