BDBM209938 US9546153, ex. 206
SMILES CC(C)NC(=O)N[C@H]1CC[C@@H](CC1)NC(=O)c1cnc(Nc2ccc3ncsc3c2)cc1NC(C)C
InChI Key InChIKey=MZFJZTDEFNJXPP-IYARVYRRSA-N
Data  1 IC50
  Tab Delimited (TSV)   2D SDfile   Computed 3D by Vconf -m prep SDfile
Find this compound or compounds like it in BindingDB:
Activity Spreadsheet -- Enzyme Inhibition Constant Data from BindingDB
Found 1 hit for monomerid = 209938
TargetInterleukin-1 receptor-associated kinase 4(Homo sapiens (Human))
Bristol-Myers Squibb
US Patent
LigandPNGBDBM209938(US9546153, ex. 206)
Affinity DataIC50:  2.10nMpH: 7.2 T: 2°C. Assay description: The assays were performed in U-bottom 384-well plates. The final assay volume was 30 μL prepared from 15 μL additions of enzyme and substra...
Ligand InfoPC cidPC sid
In DepthDetails US Patent