BDBM212735 US9556111, Table 1.20
SMILES Cc1ccc(NC(=O)Nc2ccc(CN(Cc3ccc(NC(=O)Nc4ccc(C)cc4)cc3)Cc3ccc(NC(=O)Nc4ccc(C)cc4)cc3)cc2)cc1
InChI Key InChIKey=HPBWZXNJKZYACA-UHFFFAOYSA-N
Data  1 EC50
  Tab Delimited (TSV)   2D SDfile   Computed 3D by Vconf -m prep SDfile
Find this compound or compounds like it in BindingDB:
Activity Spreadsheet -- Enzyme Inhibition Constant Data from BindingDB
Found 1 hit for monomerid = 212735
TargetA-kinase anchor protein 7 isoform gamma(Homo sapiens (Human))
Universitetet I Oslo
US Patent
LigandPNGBDBM212735(US9556111, Table 1.20)
Affinity DataEC50:  5.20E+3nM. Assay description: Stable and optimal assay conditions were determined by cross-titrating GST-AKAP18δ and biotinylated PLB using 10 μg/ml glutathione acceptor...
Ligand InfoPC cidPC sid
In DepthDetails US Patent