BDBM212762 US9278954, 7.4
SMILES CCNC(=O)C(C)c1ccc(O[C@@H]2CCN(C2)c2cccc(c2)C(F)(F)F)cc1
InChI Key InChIKey=IMQSQUOUMPLUQP-YQYDADCPSA-N
Data  1 IC50
  Tab Delimited (TSV)   2D SDfile   Computed 3D by Vconf -m prep SDfile
Find this compound or compounds like it in BindingDB:
Activity Spreadsheet -- Enzyme Inhibition Constant Data from BindingDB
Found 1 hit for monomerid = 212762
TargetAcetyl-CoA carboxylase 2 [129-967](Homo sapiens (Human))
Boehringer Ingelheim International
US Patent
LigandPNGBDBM212762(US9278954, 7.4)
Affinity DataIC50:  224nMpH: 7.5Assay Description:Malonyl CoA formation by acetyl CoA carboxylases is stoichometrically linked to the consumption of ATP. ACC2 activity is measured in a NADH-linked ki...
Ligand InfoPC cidPC sid
In DepthDetails US Patent