BDBM213594 US9278981, 186
SMILES O[C@@H]1CCN(C1)c1ncc(cc1-c1cncnc1)C(=O)Nc1ccc(SC(F)(F)F)cc1
InChI Key InChIKey=UHBHXEYMLMAMQC-MRXNPFEDSA-N
Data  7 IC50
  Tab Delimited (TSV)   2D SDfile   Computed 3D by Vconf -m prep SDfile
Find this compound or compounds like it in BindingDB:
Activity Spreadsheet -- Enzyme Inhibition Constant Data from BindingDB
Found 7 hits for monomerid = 213594
TargetTyrosine-protein kinase ABL1 [64-515](Homo sapiens (Human))
Novartis
US Patent
LigandPNGBDBM213594(US9278981, 186)
Affinity DataIC50:  5nMpH: 7.5 T: 2°C. Assay description: For determination of ABL kinase activity, the radiometric filter-binding assay was used. The assay was performed by mixing 10 uL of the compound pre-...
Ligand InfoPC cidPC sid
In DepthDetails US Patent
TargetTyrosine-protein kinase ABL1 [64-515](Homo sapiens (Human))
Novartis
US Patent
LigandPNGBDBM213594(US9278981, 186)
Affinity DataIC50:  0.200nMpH: 7.5 T: 2°C. Assay description: The assay plates were prepared by addition of 50 nL per well of compound solution in 90% DMSO. The kinase reactions were started by stepwise addition...
Ligand InfoPC cidPC sid
In DepthDetails US Patent
TargetTyrosine-protein kinase ABL1(Homo sapiens (Human))
Novartis
US Patent
LigandPNGBDBM213594(US9278981, 186)
Affinity DataIC50:  0.700nM. Assay description: Test compounds were resuspended in DMSO at a concentration of 10 mM. A serial three-fold dilution of each compound with DMSO was performed in 384-wel...
Ligand InfoPC cidPC sid
In DepthDetails US Patent
TargetTyrosine-protein kinase ABL1(Homo sapiens (Human))
Novartis
US Patent
LigandPNGBDBM213594(US9278981, 186)
Affinity DataIC50:  0.400nM. Assay description: Inhibition of ABL1 (64 to 515 residues)(unknown origin) expressed in Escherichia coli using FITC-Ahx-EAIYAAPFAKKK-NH2 peptide as substrate after 60 m...
Ligand InfoPC cidPC sid
In DepthDetails ArticlePubMed
TargetPotassium voltage-gated channel subfamily H member 2(Homo sapiens (Human))
Novartis Institutes For Biomedical Research
Curated by ChEMBL
LigandPNGBDBM213594(US9278981, 186)
Affinity DataIC50:  1.05E+4nM. Assay description: Displacement of [3H]dofetilide from human ERG by high throughput assay
Ligand InfoPC cidPC sid
In DepthDetails ArticlePubMed
TargetPotassium voltage-gated channel subfamily H member 2(Homo sapiens (Human))
Novartis Institutes For Biomedical Research
Curated by ChEMBL
LigandPNGBDBM213594(US9278981, 186)
Affinity DataIC50:  1.50E+3nM. Assay description: Inhibition of human ERG by automated patch clamp assay
Ligand InfoPC cidPC sid
In DepthDetails ArticlePubMed
TargetTyrosine-protein kinase ABL1(Homo sapiens (Human))
Novartis
US Patent
LigandPNGBDBM213594(US9278981, 186)
Affinity DataIC50:  19nM. Assay description: Test compounds were resuspended in DMSO at a concentration of 10 mM. A serial three-fold dilution of each compound with DMSO was performed in 384-wel...
Ligand InfoPC cidPC sid
In DepthDetails US Patent