BDBM21417 4-Alkyl-4-methoxypiperidine derivative, 8i::N-[(4-{[(2R)-4-(dimethylamino)-1-(phenylsulfanyl)butan-2-yl]amino}-3-nitrobenzene)sulfonyl]-4-{4-[(2-fluorophenyl)methyl]-4-methoxypiperidin-1-yl}benzamide
SMILES COC1(Cc2ccccc2F)CCN(CC1)c1ccc(cc1)C(=O)NS(=O)(=O)c1ccc(N[C@H](CCN(C)C)CSc2ccccc2)c(c1)[N+]([O-])=O
InChI Key InChIKey=WOKKFKCBYMRFBZ-SSEXGKCCSA-N
Data  2 KI  1 IC50  3 EC50
  Tab Delimited (TSV)   2D SDfile   Computed 3D by Vconf -m prep SDfile
Find this compound or compounds like it in BindingDB:
Activity Spreadsheet -- Enzyme Inhibition Constant Data from BindingDB
Found 3 hits for monomerid = 21417
TargetBcl-2-like protein 1(Homo sapiens (Human))
Abbott Laboratories
LigandPNGBDBM21417(4-Alkyl-4-methoxypiperidine derivative, 8i | N-[(4...)
Affinity DataKi:  0.900nM ΔG°:  -12.3kcal/mole IC50:  79nM EC50:  180nMpH: 7.4 T: 2°C. Assay description: The binding affinities (Ki) of compounds were determined using fluorescence polarization assays (FPA) that measure their ability to competitively dis...
In DepthDetails ArticlePubMed
TargetApoptosis regulator Bcl-2(Homo sapiens (Human))
Abbott Laboratories
LigandPNGBDBM21417(4-Alkyl-4-methoxypiperidine derivative, 8i | N-[(4...)
Affinity DataKi:  3.10nM EC50:  100nM. Assay description: The binding affinities (Ki) of compounds were determined using fluorescence polarization assays (FPA) that measure their ability to competitively dis...
In DepthDetails ArticlePubMed
TargetBcl-2-like protein 1(Homo sapiens (Human))
Abbott Laboratories
LigandPNGBDBM21417(4-Alkyl-4-methoxypiperidine derivative, 8i | N-[(4...)
Affinity DataEC50:  180nM. Assay description: Inhibition of Bcl-XL
In DepthDetails ArticlePubMed