BDBM218692 US9296757, 14
SMILES Fc1cccc(CNC(=O)C2CCc3c(C2)sc2ncnc(Nc4ccc5[nH]c(=O)sc5c4)c32)c1
InChI Key
Data  1 IC50
  Tab Delimited (TSV)   2D SDfile   Computed 3D by Vconf -m prep SDfile
Find this compound or compounds like it in BindingDB:
Activity Spreadsheet -- Enzyme Inhibition Constant Data from BindingDB
Found 1 hit for monomerid = 218692
LigandPNGBDBM218692(US9296757, 14)
Affinity DataIC50:  25nMpH: 7.5 T: 2°C. Assay description: For the assay 50 nL of a 100 fold concentrated solution of the test compound in DMSO was pipetted into a black low volume 384 well microtiter plate (...
Ligand InfoPC cidPC sid
In DepthDetails US Patent