BDBM218953 US9303033, H5, Table 15A, Compound 1
SMILES COc1cccc(c1)-c1cc(NC2CC2)n2ncc(\C=C3/SC(=O)NC3=O)c2n1
InChI Key InChIKey=XLSBTYHDGICKDW-PXNMLYILSA-N
Data  2 IC50
  Tab Delimited (TSV)   2D SDfile   Computed 3D by Vconf -m prep SDfile
Find this compound or compounds like it in BindingDB:
Activity Spreadsheet -- Enzyme Inhibition Constant Data from BindingDB
Found 2 hits for monomerid = 218953
TargetCasein kinase II subunit beta(Homo sapiens (Human))
Senhwa Biosciences
US Patent
LigandPNGBDBM218953(US9303033, H5, Table 15A, Compound 1)
Affinity DataIC50:  815nMpH: 7.0Assay Description:5 uM ATP: Test compounds dissolved and diluted in DMSO (2 μl) were added to a reaction mixture comprising 10 μl of 5× Reaction Buffer (40 m...
Ligand InfoPC cidPC sid
In DepthDetails US Patent
TargetCasein kinase II subunit alpha/beta(Homo sapiens (Human))
Senhwa Biosciences
US Patent
LigandPNGBDBM218953(US9303033, H5, Table 15A, Compound 1)
Affinity DataIC50: <100nMpH: 7.2Assay Description:In a final reaction volume of 50 μl, CK2 ααββ (4 ng, 8.5 mU) was incubated with various concentrations of test compounds in ...
Ligand InfoPC cidPC sid
In DepthDetails US Patent