BDBM22071 6-[(2-phenylethyl)amino]-9-(pyridin-3-ylmethyl)-9H-purine-2-carbonitrile::Compound 3{13,10}
SMILES N#Cc1nc(NCCc2ccccc2)c2ncn(Cc3cccnc3)c2n1
InChI Key InChIKey=DQRYWCIRYCHUDT-UHFFFAOYSA-N
Data  1 IC50
  Tab Delimited (TSV)   2D SDfile   Computed 3D by Vconf -m prep SDfile
Find this compound or compounds like it in BindingDB:
Activity Spreadsheet -- Enzyme Inhibition Constant Data from BindingDB
Found 1 hit for monomerid = 22071
TargetCathepsin B-like cysteine protease(Trypanosoma brucei)
University Of California San Francisco
LigandPNGBDBM22071(6-[(2-phenylethyl)amino]-9-(pyridin-3-ylmethyl)-9H...)
Affinity DataIC50:  1.00E+4nMpH: 5.5 T: 2°C. Assay description: Enzyme activity was assayed in a 96-well plate format. TbcatB was incubated with inhibitor compound at room temperature for 20 min before the additio...
In DepthDetails ArticlePubMed