BDBM223444 US9320722, CB29
SMILES CC(=O)Nc1ccc(Nc2ccc(cc2[N+](O)=O)S(C)(=O)=O)cc1
InChI Key InChIKey=UMQXEFMHJOVDEQ-UHFFFAOYSA-O
Data  1 IC50
  Tab Delimited (TSV)   2D SDfile   Computed 3D by Vconf -m prep SDfile
Find this compound or compounds like it in BindingDB:
Activity Spreadsheet -- Enzyme Inhibition Constant Data from BindingDB
Found 1 hit for monomerid = 223444
TargetAldehyde dehydrogenase, dimeric NADP-preferring(Homo sapiens (Human))
Indiana University Research And Technology
US Patent
LigandPNGBDBM223444(US9320722, CB29)
Affinity DataIC50:  1.60E+4nMpH: 7.5Assay Description:IC50 values were determined for CB29 and its analogs using propionaldehyde as the substrate for ALDH1A1 and ALDH2 or benzaldehyde as the substrate fo...
Ligand InfoPC cidPC sid
In DepthDetails US Patent