BDBM225371 Chk1_126
SMILES COc1ccc(COc2cc3Cc4c(n[nH]c4-c4ccc(Br)cc4)-c3cc2OC)cc1
InChI Key InChIKey=USEZUEOONINRQQ-UHFFFAOYSA-N
Data  1 KI
  Tab Delimited (TSV)   2D SDfile   Computed 3D by Vconf -m prep SDfile
Find this compound or compounds like it in BindingDB:
Activity Spreadsheet -- Enzyme Inhibition Constant Data from BindingDB
Found 1 hit for monomerid = 225371
TargetSerine/threonine-protein kinase Chk1 [2-280](Homo sapiens (Human))
D3R/Abbott
LigandPNGBDBM225371(Chk1_126)
Affinity DataKi: >1.00E+4nM. Assay description: 33P-Radiometric_Method1
Ligand InfoPC cidPC sid
In DepthDetails PubMed