BDBM225374 Chk1_135
SMILES CCc1ccc(CCOc2cc3Cc4c(n[nH]c4-c4ccc(cc4)-c4ccc(O)cc4)-c3cc2OC)nc1
InChI Key InChIKey=JEVGZWNOZXXJPR-UHFFFAOYSA-N
Data  1 KI
  Tab Delimited (TSV)   2D SDfile   Computed 3D by Vconf -m prep SDfile
Find this compound or compounds like it in BindingDB:
Activity Spreadsheet -- Enzyme Inhibition Constant Data from BindingDB
Found 1 hit for monomerid = 225374
TargetSerine/threonine-protein kinase Chk1 [2-280](Homo sapiens (Human))
D3R/Abbott
LigandPNGBDBM225374(Chk1_135)
Affinity DataKi:  23.1nM. Assay description: 33P-Radiometric_Method1
Ligand InfoPC cidPC sid
In DepthDetails PubMed