BDBM225951 FXR_41
SMILES COC(=O)c1ccc(CN2C(=O)C3(CCN(CC3)S(=O)(=O)c3ccccc3Cl)c3cc(Br)ccc23)cc1
InChI Key InChIKey=ZOCXGYHZTQQXPP-UHFFFAOYSA-N
Data  1 IC50
  Tab Delimited (TSV)   2D SDfile   Computed 3D by Vconf -m prep SDfile
Find this compound or compounds like it in BindingDB:
Activity Spreadsheet -- Enzyme Inhibition Constant Data from BindingDB
Found 1 hit for monomerid = 225951
TargetBile acid receptor(Homo sapiens (Human))
D3R/Abbott
LigandPNGBDBM225951(FXR_41)
Affinity DataIC50: >1.00E+5nMpH: 7.4Assay Description:The assay buffer contained 50 mM HEPES (pH 7.4), 10 mM NaCl, 5 mM MgCl2 and 0.01% CHAPS. The reactions were incubated for 30 min in the presence of [...
Ligand InfoPC cidPC sid
In DepthDetails PubMed