BDBM225988 FXR_81
SMILES Cc1c(Cl)cccc1S(=O)(=O)N1CCC2(CC1)C(=O)N(Cc1ccc(cc1)C(O)=O)c1ccc(Br)cc21
InChI Key InChIKey=PJGJCVVVCGJTRL-UHFFFAOYSA-N
Data  1 IC50
  Tab Delimited (TSV)   2D SDfile   Computed 3D by Vconf -m prep SDfile
Find this compound or compounds like it in BindingDB:
Activity Spreadsheet -- Enzyme Inhibition Constant Data from BindingDB
Found 1 hit for monomerid = 225988
TargetBile acid receptor(Homo sapiens (Human))
D3R/Abbott
LigandPNGBDBM225988(FXR_81)
Affinity DataIC50:  2.69E+3nMpH: 7.4Assay Description:The assay buffer contained 50 mM HEPES (pH 7.4), 10 mM NaCl, 5 mM MgCl2 and 0.01% CHAPS. The reactions were incubated for 30 min in the presence of [...
Ligand InfoPC cidPC sid
In DepthDetails PubMed