BDBM228518 US9340542, 8
SMILES Oc1ccc2C[C@]34CC[C@@]5(C[C@]3(CCN(CC3CC3)C4)c2c1)NC(=O)NC5=O
InChI Key InChIKey=QCIIDNPIIDWWMQ-BDTNDASRSA-N
Data  2 KI  2 EC50
  Tab Delimited (TSV)   2D SDfile   Computed 3D by Vconf -m prep SDfile
Find this compound or compounds like it in BindingDB:
Activity Spreadsheet -- Enzyme Inhibition Constant Data from BindingDB
Found 4 hits for monomerid = 228518
TargetKappa-type opioid receptor(Homo sapiens (Human))
Purdue Pharma
US Patent
LigandPNGBDBM228518(US9340542, 8)
Affinity DataKi:  72.5nMpH: 7.4Assay Description:Radioligand dose displacement assays used 0.4 nM [3H]-U69,593 (GE Healthcare, Piscataway, N.J.; 40 Ci/mmole) with 15 μg membrane protein (recomb...
Ligand InfoPC cidPC sid
In DepthDetails US Patent
TargetMu-type opioid receptor(Homo sapiens (Human))
Purdue Pharma
US Patent
LigandPNGBDBM228518(US9340542, 8)
Affinity DataKi:  473nM ΔG°:  -8.62kcal/molepH: 7.4 T: 2°C. Assay description: Radioligand dose-displacement binding assays for μ-opioid receptors used 0.3 nM [3H]-diprenorphine (Perkin Elmer, Shelton, Conn.), with 5 mg mem...
Ligand InfoPC cidPC sid
In DepthDetails US Patent
TargetKappa-type opioid receptor(Homo sapiens (Human))
Purdue Pharma
US Patent
LigandPNGBDBM228518(US9340542, 8)
Affinity DataEC50:  384nMpH: 7.4Assay Description:Functional [35S]GTPγS binding assays were conducted as follows. κ opioid receptor membrane solution was prepared by sequentially adding fin...
Ligand InfoPC cidPC sid
In DepthDetails US Patent
TargetMu-type opioid receptor(Homo sapiens (Human))
Purdue Pharma
US Patent
LigandPNGBDBM228518(US9340542, 8)
Affinity DataEC50:  414nMpH: 7.4Assay Description:[35S]GTPγS functional assays were conducted using freshly thawed p-receptor membranes prepared in-house from a cell line expressing recombinant ...
Ligand InfoPC cidPC sid
In DepthDetails US Patent