BDBM23 (4R,5S,6S,7R)-4,7-dibenzyl-1-(cyclopropylmethyl)-5,6-dihydroxy-3-[(2E)-3-(1H-pyrazol-4-yl)prop-2-en-1-yl]-1,3-diazepan-2-one::DMPC Cyclic Urea 3
SMILES O[C@@H]1[C@@H](O)[C@@H](Cc2ccccc2)N(CC2CC2)C(=O)N(C\C=C\c2cn[nH]c2)[C@@H]1Cc1ccccc1
InChI Key InChIKey=HYNYUFZPPJMPOB-UTWJFGBXSA-N
Data  2 KI
  Tab Delimited (TSV)   2D SDfile   Computed 3D by Vconf -m prep SDfile
Find this compound or compounds like it in BindingDB:
Activity Spreadsheet -- Enzyme Inhibition Constant Data from BindingDB
Found 2 hits for monomerid = 23
TargetGag-Pol polyprotein [489-587](Human immunodeficiency virus type 1)
TBA
Curated by ChEMBL
LigandPNGBDBM23((4R,5S,6S,7R)-4,7-dibenzyl-1-(cyclopropylmethyl)-5...)
Affinity DataKi:  0.410nM. Assay description: Compound was evaluated for binding affinity towards HIV-Protease enzyme.
In DepthDetails Article
TargetDimer of Gag-Pol polyprotein [501-599](Human immunodeficiency virus type 1)
Dupont Pharmaceuticals
LigandPNGBDBM23((4R,5S,6S,7R)-4,7-dibenzyl-1-(cyclopropylmethyl)-5...)
Affinity DataKi:  0.410nM ΔG°:  -13.3kcal/molepH: 5.5 T: 2°C. Assay description: Ki values were determined with recombinant single-chain dimeric HIV protease and a fluorescent substrate. The use of single-chain dimeric protease a...
In DepthDetails ArticlePubMed