BDBM230194 US9340500, I-038
SMILES CN(C)CC(C)(C)CN(C)CCCn1c(C)c(cc1-c1ccccc1)C(=O)Nc1cccc(c1)C(F)(F)F
InChI Key InChIKey=MGMYFEKOXVOISQ-UHFFFAOYSA-N
Data  1 KI
  Tab Delimited (TSV)   2D SDfile   Computed 3D by Vconf -m prep SDfile
Find this compound or compounds like it in BindingDB:
Activity Spreadsheet -- Enzyme Inhibition Constant Data from BindingDB
Found 1 hit for monomerid = 230194
TargetTransient receptor potential cation channel subfamily V member 4(Homo sapiens (Human))
Shionogi
US Patent
LigandPNGBDBM230194(US9340500, I-038)
Affinity DataKi:  352nM ΔG°:  -9.15kcal/moleT: 2°C. Assay description: Test Example 3: (1) The TRPV4 inhibitory activity was measured using CHO-K1 cells stably expressing human TRPV4 (hTRPV4/CHO cells). (2) Frozen cells ...
Ligand InfoPC cidPC sid
In DepthDetails US Patent