BDBM234716 US9353104, 4
SMILES COc1ccc(nc1)[C@H]1C[C@@H]1COc1cc(NCc2nnc(C)s2)c(=O)n(C)n1
InChI Key InChIKey=BOPMKVMXOOLARY-OCCSQVGLSA-N
Data  1 KI
  Tab Delimited (TSV)   2D SDfile   Computed 3D by Vconf -m prep SDfile
Find this compound or compounds like it in BindingDB:
Activity Spreadsheet -- Enzyme Inhibition Constant Data from BindingDB
Found 1 hit for monomerid = 234716
LigandPNGBDBM234716(US9353104, 4)
Affinity DataKi:  0.0150nM. Assay description: The fluorescence polarization assay for cyclic nucleotide phosphodiesterases was performed using an IMAP® FP kit supplied by Molecular Devices, Sunny...
Ligand InfoPC cidPC sid
In DepthDetails US Patent