BDBM23896 3-amidinophenylalanine deriv., 40::N-(2-carbamimidamidoethyl)-1-[(2S)-3-(3-carbamimidoylphenyl)-2-[(9,10-dioxo-9,10-dihydroanthracene-2-)sulfonamido]propanoyl]piperidine-4-carboxamide
SMILES [#7]\[#6](-[#7])=[#7]/[#6]-[#6]-[#7]-[#6](=O)-[#6]-1-[#6]-[#6]-[#7](-[#6]-[#6]-1)-[#6](=O)-[#6@H](-[#6]-c1cccc(c1)-[#6](-[#7])=[#7])-[#7]S(=O)(=O)c1ccc2-[#6](=O)-c3ccccc3-[#6](=O)-c2c1
InChI Key InChIKey=ASERQAPACCCWLA-MHZLTWQESA-N
Data  5 KI
  Tab Delimited (TSV)   2D SDfile   Computed 3D by Vconf -m prep SDfile
Find this compound or compounds like it in BindingDB:
Activity Spreadsheet -- Enzyme Inhibition Constant Data from BindingDB
Found 5 hits for monomerid = 23896
TargetSuppressor of tumorigenicity 14 protein(Homo sapiens (Human))
Curacyte Chemistry
LigandPNGBDBM23896(3-amidinophenylalanine deriv., 40 | N-(2-carbamimi...)
Affinity DataKi:  13nM. Assay description: The measurements were carried out on a microplate reader. Two concentrations of the substrate and five concentrations of the inhibitor were used. Af...
In DepthDetails ArticlePubMed
TargetProthrombin(Bos taurus (Bovine))
Curacyte Chemistry
LigandPNGBDBM23896(3-amidinophenylalanine deriv., 40 | N-(2-carbamimi...)
Affinity DataKi:  420nM. Assay description: The measurements were carried out on a microplate reader. Two concentrations of the substrate and five concentrations of the inhibitor were used. Af...
In DepthDetails ArticlePubMed
TargetUrokinase-type plasminogen activator(Homo sapiens (Human))
Curacyte Chemistry
LigandPNGBDBM23896(3-amidinophenylalanine deriv., 40 | N-(2-carbamimi...)
Affinity DataKi:  3.60E+3nM. Assay description: The measurements were carried out on a microplate reader. Two concentrations of the substrate and five concentrations of the inhibitor were used. Af...
In DepthDetails ArticlePubMed
TargetPlasminogen(Homo sapiens (Human))
Curacyte Chemistry
LigandPNGBDBM23896(3-amidinophenylalanine deriv., 40 | N-(2-carbamimi...)
Affinity DataKi:  4.10E+3nM. Assay description: The measurements were carried out on a microplate reader. Two concentrations of the substrate and five concentrations of the inhibitor were used. Af...
In DepthDetails ArticlePubMed
TargetCoagulation factor X(Bos taurus)
Curacyte Chemistry
LigandPNGBDBM23896(3-amidinophenylalanine deriv., 40 | N-(2-carbamimi...)
Affinity DataKi:  4.90E+3nM. Assay description: The measurements were carried out on a microplate reader. Two concentrations of the substrate and five concentrations of the inhibitor were used. Af...
In DepthDetails ArticlePubMed