BDBM239559 US9394309, 12
SMILES Cc1cn(-c2cc(NC(=O)c3cc(cc(c3)S(F)(F)(F)(F)F)C#N)ccc2C)c2cc(nn12)-c1cn[nH]c1
InChI Key InChIKey=FZUGKZNREGJJLQ-UHFFFAOYSA-N
Data  2 IC50
  Tab Delimited (TSV)   2D SDfile   Computed 3D by Vconf -m prep SDfile
Find this compound or compounds like it in BindingDB:
Activity Spreadsheet -- Enzyme Inhibition Constant Data from BindingDB
Found 2 hits for monomerid = 239559
TargetAngiopoietin-1 receptor [776-1124](Homo sapiens (Human))
Bayer Pharma Aktiengesellschaft
US Patent
LigandPNGBDBM239559(US9394309, 12)
Affinity DataIC50:  4.70nMpH: 9.6 T: 2°C. Assay description: For measuring the autophosphorylation of the endogenous Tie2 receptor in the cell lysates prepared, a self-prepared anti-Tie2 antibody directed again...
Ligand InfoPC cidPC sid
In DepthDetails US Patent
TargetAngiopoietin-1 receptor [776-1124](Homo sapiens (Human))
Bayer Pharma Aktiengesellschaft
US Patent
LigandPNGBDBM239559(US9394309, 12)
Affinity DataIC50:  0.700nMpH: 7.0 T: 2°C. Assay description: For the assay, 50 nl of a 100-fold concentrated solution of the respective test substance in DMSO were pipetted into a black low-volume 384-well micr...
Ligand InfoPC cidPC sid
In DepthDetails US Patent