BDBM240706 US9422243, 3
SMILES NCCOc1c([nH]c(=O)c2cc(F)ccc12)-c1ccc(cc1)N1CCOCC1
InChI Key InChIKey=KSTGCHRYORWWOO-UHFFFAOYSA-N
Data  2 Kd
  Tab Delimited (TSV)   2D SDfile   Computed 3D by Vconf -m prep SDfile
Find this compound or compounds like it in BindingDB:
Activity Spreadsheet -- Enzyme Inhibition Constant Data from BindingDB
Found 2 hits for monomerid = 240706
TargetPoly [ADP-ribose] polymerase 2(Homo sapiens (Human))
Nerviano Medical Sciences
US Patent
LigandPNGBDBM240706(US9422243, 3)
Affinity DataKd:  7.20E+3nM. Assay description: The identification of compounds capable of binding several PARP proteins is carried out through a screening method including the steps of a) provi...
Ligand InfoPC cidPC sid
In DepthDetails US Patent
TargetPoly [ADP-ribose] polymerase 1(Homo sapiens (Human))
Nerviano Medical Sciences
US Patent
LigandPNGBDBM240706(US9422243, 3)
Affinity DataKd:  40nM. Assay description: The identification of compounds capable of binding several PARP proteins is carried out through a screening method including the steps of a) provi...
Ligand InfoPC cidPC sid
In DepthDetails US Patent