BDBM243207 5,5-dimethyl-n-(3-(methylsulfonyl)benzyl)-2-((tetrahydro-2h-pyran-4-yl)amino)-5h-pyrrolo[3,4-d]pyrimidine-6(7h)-carboxamide::US9546173, cmpd 4
SMILES CC1(C)N(Cc2nc(NC3CCOCC3)ncc12)C(=O)NCc1cccc(c1)S(C)(=O)=O
InChI Key InChIKey=FRBWAPYVNDAKIW-UHFFFAOYSA-N
Data  1 IC50
  Tab Delimited (TSV)   2D SDfile   Computed 3D by Vconf -m prep SDfile
Find this compound or compounds like it in BindingDB:
Activity Spreadsheet -- Enzyme Inhibition Constant Data from BindingDB
Found 1 hit for monomerid = 243207
TargetMitogen-activated protein kinase 1(Homo sapiens (Human))
Novartis
US Patent
LigandPNGBDBM243207(5,5-dimethyl-n-(3-(methylsulfonyl)benzyl)-2-((tetr...)
Affinity DataIC50:  18nMpH: 7.5Assay Description:Compound potency against activated ERK2 was determined using a kinase assay that measures ERK2-catalyzed phosphorylation of biotinylated ERKtide pept...
Ligand InfoPC cidPC sid
In DepthDetails US Patent