BDBM243229 5,5-dimethyl-2-((tetrahydro-2h-pyran-4-yl)amino)-n-(2,2,2-trifluoro-1-phenylethyl)-5h-pyrrolo[3,4-d]pyrimidine-6(7h)-carboxamide::US9546173, cmpd 26
SMILES CC1(C)N(Cc2nc(NC3CCOCC3)ncc12)C(=O)NC(c1ccccc1)C(F)(F)F
InChI Key InChIKey=RXGPBVGLLMVCND-UHFFFAOYSA-N
Data  1 IC50
  Tab Delimited (TSV)   2D SDfile   Computed 3D by Vconf -m prep SDfile
Find this compound or compounds like it in BindingDB:
Activity Spreadsheet -- Enzyme Inhibition Constant Data from BindingDB
Found 1 hit for monomerid = 243229
TargetMitogen-activated protein kinase 1(Homo sapiens (Human))
Novartis
US Patent
LigandPNGBDBM243229(5,5-dimethyl-2-((tetrahydro-2h-pyran-4-yl)amino)-n...)
Affinity DataIC50:  125nMpH: 7.5Assay Description:Compound potency against activated ERK2 was determined using a kinase assay that measures ERK2-catalyzed phosphorylation of biotinylated ERKtide pept...
Ligand InfoPC cidPC sid
In DepthDetails US Patent