BDBM243984 US9546173, cmpd 60::n-((s)-2-hydroxy-1-phenylethyl)-2-(((1r,4s)-4-hydroxycyclohexyl)amino)-5,5-dimethyl-5h-pyrrolo[3,4-d]pyrimidine-6(7h)-carboxamide
SMILES CC1(C)N(Cc2nc(N[C@H]3CC[C@H](O)CC3)ncc12)C(=O)N[C@H](CO)c1ccccc1
InChI Key InChIKey=AXSTURZYEHQCBE-MBOZVWFJSA-N
Data  1 IC50
  Tab Delimited (TSV)   2D SDfile   Computed 3D by Vconf -m prep SDfile
Find this compound or compounds like it in BindingDB:
Activity Spreadsheet -- Enzyme Inhibition Constant Data from BindingDB
Found 1 hit for monomerid = 243984
TargetMitogen-activated protein kinase 1(Homo sapiens (Human))
Novartis
US Patent
LigandPNGBDBM243984(US9546173, cmpd 60 | n-((s)-2-hydroxy-1-phenylethy...)
Affinity DataIC50:  82nMpH: 7.5Assay Description:Compound potency against activated ERK2 was determined using a kinase assay that measures ERK2-catalyzed phosphorylation of biotinylated ERKtide pept...
Ligand InfoPC cidPC sid
In DepthDetails US Patent