BDBM244003 US9546173, cmpd 76::n-(4-chlorobenzyl)-2'-((tetrahydro-2h-pyran-4-yl)amino)spiro[cyclobutane-1,5'-pyrrolo[3,4-d]pyrimidine]-6'(7'h)-carboxamide
SMILES Clc1ccc(CNC(=O)N2Cc3nc(NC4CCOCC4)ncc3C22CCC2)cc1
InChI Key InChIKey=LKHQALRMIGMTBW-UHFFFAOYSA-N
Data  1 IC50
  Tab Delimited (TSV)   2D SDfile   Computed 3D by Vconf -m prep SDfile
Find this compound or compounds like it in BindingDB:
Activity Spreadsheet -- Enzyme Inhibition Constant Data from BindingDB
Found 1 hit for monomerid = 244003
TargetMitogen-activated protein kinase 1(Homo sapiens (Human))
Novartis
US Patent
LigandPNGBDBM244003(US9546173, cmpd 76 | n-(4-chlorobenzyl)-2'-((t...)
Affinity DataIC50:  31nMpH: 7.5Assay Description:Compound potency against activated ERK2 was determined using a kinase assay that measures ERK2-catalyzed phosphorylation of biotinylated ERKtide pept...
Ligand InfoPC cidPC sid
In DepthDetails US Patent