BDBM24764 5-[3-fluoro-4-({6-methoxy-7-[3-(morpholin-4-yl)propoxy]quinolin-4-yl}oxy)phenyl]-3-methyl-2-[(4-methylphenyl)methyl]-3,4-dihydropyrimidin-4-one::pyrimidone, 42
SMILES COc1cc2c(Oc3ccc(cc3F)-c3cnc(Cc4ccc(C)cc4)n(C)c3=O)ccnc2cc1OCCCN1CCOCC1
InChI Key InChIKey=ATTJPKDHHQLOJJ-UHFFFAOYSA-N
Data  1 KI  1 IC50
  Tab Delimited (TSV)   2D SDfile   Computed 3D by Vconf -m prep SDfile
Find this compound or compounds like it in BindingDB:
Activity Spreadsheet -- Enzyme Inhibition Constant Data from BindingDB
Found 2 hits for monomerid = 24764
TargetHepatocyte growth factor receptor(Homo sapiens (Human))
Amgen
LigandPNGBDBM24764(5-[3-fluoro-4-({6-methoxy-7-[3-(morpholin-4-yl)pro...)
Affinity DataKi:  9.60nM ΔG°:  -10.8kcal/molepH: 7.5 T: 2°C. Assay description: In vitro kinase assays were done to establish IC50 values against recombinant enzymes using homogeneous time-resolved fluorescence (HTRF) assay. For ...
In DepthDetails ArticlePubMed
TargetHepatocyte growth factor receptor(Homo sapiens (Human))
Amgen
LigandPNGBDBM24764(5-[3-fluoro-4-({6-methoxy-7-[3-(morpholin-4-yl)pro...)
Affinity DataIC50:  9.60nM. Assay description: Inhibition of human c-MET
In DepthDetails ArticlePubMed