BDBM249228 US9458135, 16
SMILES CN1C(=O)CCc2cc(ccc12)-c1cncc(CSc2ncccc2Cl)c1
InChI Key InChIKey=DYCSGHHJCVMXGL-UHFFFAOYSA-N
Data  2 EC50
  Tab Delimited (TSV)   2D SDfile   Computed 3D by Vconf -m prep SDfile
Find this compound or compounds like it in BindingDB:
Activity Spreadsheet -- Enzyme Inhibition Constant Data from BindingDB
Found 2 hits for monomerid = 249228
TargetCytochrome P450 11B1, mitochondrial(Homo sapiens (Human))
Hoffmann-La Roche
US Patent
LigandPNGBDBM249228(US9458135, 16)
Affinity DataEC50:  45.7nM. Assay description: Herein we identified the use of the G-402 cell line as a host cell to ectopically express (transiently or stably) enzymes of the CYP11 family. Specif...
Ligand InfoPC cidPC sid
In DepthDetails US Patent
TargetCytochrome P450 11B2, mitochondrial(Homo sapiens (Human))
Hoffmann-La Roche
US Patent
LigandPNGBDBM249228(US9458135, 16)
Affinity DataEC50:  1.40nM. Assay description: Herein we identified the use of the G-402 cell line as a host cell to ectopically express (transiently or stably) enzymes of the CYP11 family. Specif...
Ligand InfoPC cidPC sid
In DepthDetails US Patent